0

ANSYS 15 Download Free with Crack - Civil Engineers PK

Microsoft office 2020 activation key. Our professional version of Ansys 5.7 has been bound to a license manager running on a windows NT server. About Us. GDTECH brings together business and technology leaders to explore the real world of AI in Digital Twin. In addition, the user can now set their own default ANSYS element variants by defining them in a FEMGV resource file (see Chapter 1). An ANSYS student is too limited. Official ANSYS Simplorer 11.0 (04/07/15) for Free!

Crack aNSS.O - ANSYS, Inc. Key Developments

Game Activation Code Generator Google Sketchup With Crack Free Download. This reference contains a complete dictionary of detailed command descriptions, arranged in alphabetical order. ANSYS System Hardware Requirements Ozen Engineering. X64 may also include a crack, serial number, unlock code or keygen (key generator). It assures the best models at a given level of efficiency in any scale the user chooses, linking micromechanics and structural analysis. The sims 3 serial key.

1

Serial number zone monitoring fy07: Topics by Science.gov

Snagit 10 full version with key https://vesta-tr.ru/forum/?download=1067. Microsoft Office 2020 Product Key with Activation Free [100% Working] ANSYS 19.1 Crack + License file Free Download [100% Working]. To create more accurate search results for Ansys 14.5 try to exclude using commonly used keywords such as: crack, download, serial, keygen, torrent, warez, etc. Ansys 12.1 X64 Magnitude Crack free download programs. Wow wpe pro buying hack 3.3.5 https://vesta-tr.ru/forum/?download=3093. There are also many tools in this bar.

Download aNSYS Fluent 15 Documents -- CFD Online Discussion Forums

This service pack addresses a defect related to fluids models with 0-thickness walls (baffles). If you are still having trouble finding Ansys 16.2 Ncode Designlife 11.0 after simplifying your search term then we highly recommend using the. Scroll the list of applications until you locate ANSYS HFSS 15.0 (64-bit) or simply click the Search field and type in "ANSYS HFSS 15.0 (64-bit)". March 28, 2020 1 Release 14.5 Goals The objective of this workshop is to illustrate the process of applying initial angular velocity to a wirebond using steps. ANSYS Student is used by hundreds of thousands of students globally. Ansys software, ansys software download, ansys software price, ansys software pvt ltd, ansys software full form, ansys software wiki, ansys software uses, ansys software requirements, ansys software latest.

2

ACCELERATING ANSYS FLUENT 15.0 USING NVIDIA GPUS

US7818275B2 US12/197, 786 US19778608A US7818275B2 US 7818275 B2 US7818275 B2 US 7818275B2 US 19778608 A US19778608 A US 19778608A US 7818275 B2 US7818275 B2 US 7818275B2 Authority US United States Prior art keywords feedback student presentation user simulation Prior art date 1999-02-08 Legal status (The legal status is an assumption and is not a legal conclusion. Ansys 15 with crack. Oovee co uk spin tires key. Adobe cs4 amtlib dll crack. Using this product, you can accurately simulate electromagnetic systems and investigate the behavior of electrical and electromagnetic devices. ANSYS Mechanical Linear and Nonlinear Dynamics 2020 ANSYS, Inc.

Hack ansys Products Crack With Updated Keygen 2020 Full – #

Track 3 deluxe full crack antivirus. ANSYS PRODUCTS 19.0 Crack, download ANSYS PRODUCTS 19 License key, ANSYS. Examples Torrent Download with keygen, crack, serial. Ansys 14 Magnitude License Generator 53 April 17 2020 ansys 14 magnitude license generator, ansys 12 magnitude license generator, ansys 15 magnitude license generator, ansys 13 magnitude license generator. If you are attempting to retrieve the hostid information for a FLEXID9 dongle, you will need to download and install the full ANSYS License Manager instead of using this process. Just download and enjoy.

3

Serial key aNSYS Products 2020 R2 Windows/Linux + Doc

For users of ANSYS 15.0, please check this link for procedures for turning on the Auto Constraint feature before creating sketches in DesignModeler. All Posts; Category 1; Category 2; Search.

ProLicenseKey - Download Activation Code, Serial Key and Crack

4

Ansys Hfss 15 X64 Crack, Serial & Keygen

The default configuration in Fluent is an outer FGMRES. Myspace account hacker v2.6 music. Many downloads like Ansys Maxwell 15.0 X64 may also include a crack, serial number, unlock code or keygen (key generator). Norton 360 activation keygen for photoshop. Further Improvements 15.1. Cracked steam 2020 turbotax.

[Request]Please help compiling latest futurerestore for iOS14

[Request]Please help compiling latest futurerestore for iOS14
I tried to compile futurerestore from marijuanARM/futurerestore 's fork.
I have compiled most of external libs :
https://preview.redd.it/8tcpwa25z4061.png?width=1258&format=png&auto=webp&s=9ca3b114ce7669de5b51f08e62865b91f2139b54

https://preview.redd.it/houpq009z4061.png?width=1112&format=png&auto=webp&s=191feca746113b617cf5a9fac237dd72acf56f94
But when I start compiling tihmstaliboffsetfinder64, it gives me an error:

https://preview.redd.it/7adfgx1qz4061.png?width=1610&format=png&auto=webp&s=e85a582646d5cbe5e534bf74f569161b48efb4e4
When compiling liboffsetfinder64 's dependecy tihmstalibinsn, it gives errors.
Macos Catalina 10.15.7
Last login: Thu Nov 19 12:25:57 on ttys001
[email protected] ~ % cd Desktop/BuildFuturerestore
[email protected] BuildFuturerestore % cd libinsn
[email protected] libinsn % ./autogen.sh
checking build system type... x86_64-apple-darwin19.6.0
checking host system type... x86_64-apple-darwin19.6.0
checking target system type... x86_64-apple-darwin19.6.0
checking how to print strings... printf
checking for gcc... gcc
checking whether the C compiler works... yes
checking for C compiler default output file name... a.out
checking for suffix of executables...
checking whether we are cross compiling... no
checking for suffix of object files... o
checking whether we are using the GNU C compiler... yes
checking whether gcc accepts -g... yes
checking for gcc option to accept ISO C89... none needed
checking whether gcc understands -c and -o together... yes
checking for a sed that does not truncate output... /usbin/sed
checking for grep that handles long lines and -e... /usbin/grep
checking for egrep... /usbin/grep -E
checking for fgrep... /usbin/grep -F
checking for ld used by gcc... /Library/DevelopeCommandLineTools/usbin/ld
checking if the linker (/Library/DevelopeCommandLineTools/usbin/ld) is GNU ld... no
checking for BSD- or MS-compatible name lister (nm)... /usbin/nm -B
checking the name lister (/usbin/nm -B) interface... BSD nm
checking whether ln -s works... yes
checking the maximum length of command line arguments... 196608
checking how to convert x86_64-apple-darwin19.6.0 file names to x86_64-apple-darwin19.6.0 format... func_convert_file_noop
checking how to convert x86_64-apple-darwin19.6.0 file names to toolchain format... func_convert_file_noop
checking for /Library/DevelopeCommandLineTools/usbin/ld option to reload object files... -r
checking for objdump... objdump
checking how to recognize dependent libraries... pass_all
checking for dlltool... no
checking how to associate runtime and link libraries... printf %s\n
checking for ar... ar
checking for archiver u/FILE support... no
checking for strip... strip
checking for ranlib... ranlib
checking for gawk... no
checking for mawk... no
checking for nawk... no
checking for awk... awk
checking command to parse /usbin/nm -B output from gcc object... ok
checking for sysroot... no
checking for a working dd... /bin/dd
checking how to truncate binary pipes... /bin/dd bs=4096 count=1
checking for mt... no
checking if : is a manifest tool... no
checking for dsymutil... dsymutil
checking for nmedit... nmedit
checking for lipo... lipo
checking for otool... otool
checking for otool64... no
checking for -single_module linker flag... yes
checking for -exported_symbols_list linker flag... yes
checking for -force_load linker flag... yes
checking how to run the C preprocessor... gcc -E
checking for ANSI C header files... yes
checking for sys/types.h... yes
checking for sys/stat.h... yes
checking for stdlib.h... yes
checking for string.h... yes
checking for memory.h... yes
checking for strings.h... yes
checking for inttypes.h... yes
checking for stdint.h... yes
checking for unistd.h... yes
checking for dlfcn.h... yes
checking for objdir... .libs
checking if gcc supports -fno-rtti -fno-exceptions... yes
checking for gcc option to produce PIC... -fno-common -DPIC
checking if gcc PIC flag -fno-common -DPIC works... yes
checking if gcc static flag -static works... no
checking if gcc supports -c -o file.o... yes
checking if gcc supports -c -o file.o... (cached) yes
checking whether the gcc linker (/Library/DevelopeCommandLineTools/usbin/ld) supports shared libraries... yes
checking dynamic linker characteristics... darwin19.6.0 dyld
checking how to hardcode library paths into programs... immediate
checking whether stripping libraries is possible... yes
checking if libtool supports shared libraries... yes
checking whether to build shared libraries... yes
checking whether to build static libraries... yes
checking for a BSD-compatible install... /usbin/install -c
checking whether build environment is sane... yes
checking for a thread-safe mkdir -p... ./install-sh -c -d
checking whether make sets $(MAKE)... yes
checking whether make supports the include directive... yes (GNU style)
checking whether make supports nested variables... yes
checking dependency style of gcc... gcc3
checking for g++... g++
checking whether we are using the GNU C++ compiler... yes
checking whether g++ accepts -g... yes
checking how to run the C++ preprocessor... g++ -E
checking for ld used by g++... /Library/DevelopeCommandLineTools/usbin/ld
checking if the linker (/Library/DevelopeCommandLineTools/usbin/ld) is GNU ld... no
checking whether the g++ linker (/Library/DevelopeCommandLineTools/usbin/ld) supports shared libraries... yes
checking for g++ option to produce PIC... -fno-common -DPIC
checking if g++ PIC flag -fno-common -DPIC works... yes
checking if g++ static flag -static works... no
checking if g++ supports -c -o file.o... yes
checking if g++ supports -c -o file.o... (cached) yes
checking whether the g++ linker (/Library/DevelopeCommandLineTools/usbin/ld) supports shared libraries... yes
checking dynamic linker characteristics... darwin19.6.0 dyld
checking how to hardcode library paths into programs... immediate
checking dependency style of g++... gcc3
checking for gcc... (cached) gcc
checking whether we are using the GNU C compiler... (cached) yes
checking whether gcc accepts -g... (cached) yes
checking for gcc option to accept ISO C89... (cached) none needed
checking whether gcc understands -c and -o together... (cached) yes
checking whether we need platform-specific build settings... checking for pkg-config... /uslocal/bin/pkg-config
checking pkg-config is at least version 0.9.0... yes
checking for libgeneral >= 32... yes
checking fcntl.h usability... yes
checking fcntl.h presence... yes
checking for fcntl.h... yes
checking for stdint.h... (cached) yes
checking for stdlib.h... (cached) yes
checking for string.h... (cached) yes
checking for unistd.h... (cached) yes
checking that generated files are newer than configure... done
configure: creating ./config.status
config.status: creating Makefile
config.status: creating include/Makefile
config.status: creating libinsn/Makefile
config.status: creating libinsn.pc
config.status: creating config.h
config.status: config.h is unchanged
config.status: executing libtool commands
config.status: executing depfiles commands

Configuration for libinsn-32:
-------------------------------------------

install prefix ..........: /uslocal

compiler ................: gcc

Now type 'make' to build libinsn-32,
and then 'make install' for installation.

[email protected] libinsn % make
(CDPATH="${ZSH_VERSION+.}:" && cd . && /bin/sh /Users/kinken/Desktop/BuildFuturerestore/libinsn/missing autoheader)
rm -f stamp-h1
touch config.h.in
cd . && /bin/sh ./config.status config.h
config.status: creating config.h
config.status: config.h is unchanged
/Library/DevelopeCommandLineTools/usbin/make all-recursive
Making all in libinsn
/bin/sh ../libtool --tag=CXX --mode=compile g++ -DHAVE_CONFIG_H -I. -I.. -I../include -I../include/libinsn -I/uslocal/include -g -O2 -stdlib=libc++ -std=c++14 -O3 -fPIC -D EXPECTIONNAME=INSNexception -MT libinsn_la-insn_decode.lo -MD -MP -MF .deps/libinsn_la-insn_decode.Tpo -c -o libinsn_la-insn_decode.lo \test -f 'insn_decode.cpp' || echo './'`insn_decode.cpp`
libtool: compile: g++ -DHAVE_CONFIG_H -I. -I.. -I../include -I../include/libinsn -I/uslocal/include -g -O2 -stdlib=libc++ -std=c++14 -O3 -fPIC -D EXPECTIONNAME=INSNexception -MT libinsn_la-insn_decode.lo -MD -MP -MF .deps/libinsn_la-insn_decode.Tpo -c insn_decode.cpp -fno-common -DPIC -o .libs/libinsn_la-insn_decode.o
In file included from insn_decode.cpp:12:
../include/libinsn/INSNexception.hpp:19:78: error: no matching constructor for initialization of 'tihmstar::exception'
INSNexception(int code, const char *filename, const char *err ...) : tihmstar::exception(code,filename,err){}
^ ~~~~~~~~~~~~~~~~~
/uslocal/include/libgeneral/exception.hpp:15:11: note: candidate constructor (the implicit copy constructor) not viable: requires 1 argument, but 3 were provided
class exception : public std::exception{
^
/uslocal/include/libgeneral/exception.hpp:22:9: note: candidate constructor not viable: requires at least 5 arguments, but 3 were provided
exception(const char *commit_count_str, const char *commit_sha_str, int line, const char *filename, const char *err ...);
^
insn_decode.cpp:121:5: error: no matching constructor for initialization of 'tihmstar::INSNexception'
assure(len != -1); //reserved value
^~~~~~~~~~~~~~~~~
/uslocal/include/libgeneral/macros.h:80:52: note: expanded from macro 'assure'
...assure(cond) do{ if ((cond) == 0) throw tihmstar::EXPECTIONNAME(VERSION_COMMIT_COUNT, VERSION_COMMIT_SHA, __LINE__, __FILE__, "assure failed"); } while(0)
^ ~~~~~~~~~~~~~~~~~~~~~~~~~~~~~~~~~~~~~~~~~~~~~~~~~~~~~~~~~~~~~~~~~~~~~~~~~~~~~
../include/libinsn/INSNexception.hpp:19:9: note: candidate constructor not viable: no known conversion from 'const char [3]' to 'int' for 1st argument
INSNexception(int code, const char *filename, const char *err ...) : tihmstar::exception(code,filename,err){}
^
../include/libinsn/INSNexception.hpp:17:11: note: candidate constructor (the implicit copy constructor) not viable: requires 1 argument, but 5 were provided
class INSNexception : public tihmstar::exception{
^
../include/libinsn/INSNexception.hpp:17:11: note: candidate constructor (the implicit move constructor) not viable: requires 1 argument, but 5 were provided
insn_decode.cpp:124:5: error: no matching constructor for initialization of 'tihmstar::INSNexception'
assure(immediate && (imms & levels) != levels); //reserved value
^~~~~~~~~~~~~~~~~~~~~~~~~~~~~~~~~~~~~~~~~~~~~~
/uslocal/include/libgeneral/macros.h:80:52: note: expanded from macro 'assure'
...assure(cond) do{ if ((cond) == 0) throw tihmstar::EXPECTIONNAME(VERSION_COMMIT_COUNT, VERSION_COMMIT_SHA, __LINE__, __FILE__, "assure failed"); } while(0)
^ ~~~~~~~~~~~~~~~~~~~~~~~~~~~~~~~~~~~~~~~~~~~~~~~~~~~~~~~~~~~~~~~~~~~~~~~~~~~~~
../include/libinsn/INSNexception.hpp:19:9: note: candidate constructor not viable: no known conversion from 'const char [3]' to 'int' for 1st argument
INSNexception(int code, const char *filename, const char *err ...) : tihmstar::exception(code,filename,err){}
^
../include/libinsn/INSNexception.hpp:17:11: note: candidate constructor (the implicit copy constructor) not viable: requires 1 argument, but 5 were provided
class INSNexception : public tihmstar::exception{
^
../include/libinsn/INSNexception.hpp:17:11: note: candidate constructor (the implicit move constructor) not viable: requires 1 argument, but 5 were provided
insn_decode.cpp:142:2: warning: TODO incomplete function implementation! [-W#warnings]
#warning TODO incomplete function implementation!
^
insn_decode.cpp:185:2: warning: TODO redo this! currently only recognises STR (immediate) [-W#warnings]
#warning TODO redo this! currently only recognises STR (immediate)
^
insn_decode.cpp:554:17: error: no matching constructor for initialization of 'tihmstar::INSNexception'
reterror("unexpected subtype");
^~~~~~~~~~~~~~~~~~~~~~~~~~~~~~
/uslocal/include/libgeneral/macros.h:84:43: note: expanded from macro 'reterror'
# define reterror(errstr ...) do{ throw tihmstar::EXPECTIONNAME(VERSION_COMMIT_COUNT, VERSION_COMMIT_SHA, __LINE__, __FILE__, errstr); } while(0)
^ ~~~~~~~~~~~~~~~~~~~~~~~~~~~~~~~~~~~~~~~~~~~~~~~~~~~~~~~~~~~~~~~~~~~~
../include/libinsn/INSNexception.hpp:19:9: note: candidate constructor not viable: no known conversion from 'const char [3]' to 'int' for 1st argument
INSNexception(int code, const char *filename, const char *err ...) : tihmstar::exception(code,filename,err){}
^
../include/libinsn/INSNexception.hpp:17:11: note: candidate constructor (the implicit copy constructor) not viable: requires 1 argument, but 5 were provided
class INSNexception : public tihmstar::exception{
^
../include/libinsn/INSNexception.hpp:17:11: note: candidate constructor (the implicit move constructor) not viable: requires 1 argument, but 5 were provided
insn_decode.cpp:560:17: error: no matching constructor for initialization of 'tihmstar::INSNexception'
reterror("unexpected subtype");
^~~~~~~~~~~~~~~~~~~~~~~~~~~~~~
/uslocal/include/libgeneral/macros.h:84:43: note: expanded from macro 'reterror'
# define reterror(errstr ...) do{ throw tihmstar::EXPECTIONNAME(VERSION_COMMIT_COUNT, VERSION_COMMIT_SHA, __LINE__, __FILE__, errstr); } while(0)
^ ~~~~~~~~~~~~~~~~~~~~~~~~~~~~~~~~~~~~~~~~~~~~~~~~~~~~~~~~~~~~~~~~~~~~
../include/libinsn/INSNexception.hpp:19:9: note: candidate constructor not viable: no known conversion from 'const char [3]' to 'int' for 1st argument
INSNexception(int code, const char *filename, const char *err ...) : tihmstar::exception(code,filename,err){}
^
../include/libinsn/INSNexception.hpp:17:11: note: candidate constructor (the implicit copy constructor) not viable: requires 1 argument, but 5 were provided
class INSNexception : public tihmstar::exception{
^
../include/libinsn/INSNexception.hpp:17:11: note: candidate constructor (the implicit move constructor) not viable: requires 1 argument, but 5 were provided
insn_decode.cpp:547:44: warning: result of comparison of constant 73031290881 with expression of type 'unsigned int' is always false
[-Wtautological-constant-out-of-range-compare]
if (BIT_RANGE(_opcode, 21, 30) == 0x1101011001 /* register_extended */) {
~~~~~~~~~~~~~~~~~~~~~~~~~~ ^ ~~~~~~~~~~~~
insn_decode.cpp:606:17: error: no matching constructor for initialization of 'tihmstar::INSNexception'
reterror("unexpected classtype for insn");
^~~~~~~~~~~~~~~~~~~~~~~~~~~~~~~~~~~~~~~~~
/uslocal/include/libgeneral/macros.h:84:43: note: expanded from macro 'reterror'
# define reterror(errstr ...) do{ throw tihmstar::EXPECTIONNAME(VERSION_COMMIT_COUNT, VERSION_COMMIT_SHA, __LINE__, __FILE__, errstr); } while(0)
^ ~~~~~~~~~~~~~~~~~~~~~~~~~~~~~~~~~~~~~~~~~~~~~~~~~~~~~~~~~~~~~~~~~~~~
../include/libinsn/INSNexception.hpp:19:9: note: candidate constructor not viable: no known conversion from 'const char [3]' to 'int' for 1st argument
INSNexception(int code, const char *filename, const char *err ...) : tihmstar::exception(code,filename,err){}
^
../include/libinsn/INSNexception.hpp:17:11: note: candidate constructor (the implicit copy constructor) not viable: requires 1 argument, but 5 were provided
class INSNexception : public tihmstar::exception{
^
../include/libinsn/INSNexception.hpp:17:11: note: candidate constructor (the implicit move constructor) not viable: requires 1 argument, but 5 were provided
insn_decode.cpp:634:13: error: no matching constructor for initialization of 'tihmstar::INSNexception'
reterror("can't get imm value of unknown instruction");
^~~~~~~~~~~~~~~~~~~~~~~~~~~~~~~~~~~~~~~~~~~~~~~~~~~~~~
/uslocal/include/libgeneral/macros.h:84:43: note: expanded from macro 'reterror'
# define reterror(errstr ...) do{ throw tihmstar::EXPECTIONNAME(VERSION_COMMIT_COUNT, VERSION_COMMIT_SHA, __LINE__, __FILE__, errstr); } while(0)
^ ~~~~~~~~~~~~~~~~~~~~~~~~~~~~~~~~~~~~~~~~~~~~~~~~~~~~~~~~~~~~~~~~~~~~
../include/libinsn/INSNexception.hpp:19:9: note: candidate constructor not viable: no known conversion from 'const char [3]' to 'int' for 1st argument
INSNexception(int code, const char *filename, const char *err ...) : tihmstar::exception(code,filename,err){}
^
../include/libinsn/INSNexception.hpp:17:11: note: candidate constructor (the implicit copy constructor) not viable: requires 1 argument, but 5 were provided
class INSNexception : public tihmstar::exception{
^
../include/libinsn/INSNexception.hpp:17:11: note: candidate constructor (the implicit move constructor) not viable: requires 1 argument, but 5 were provided
insn_decode.cpp:670:17: error: no matching constructor for initialization of 'tihmstar::INSNexception'
reterror("can't get imm value of ldr that has non immediate subtype");
^~~~~~~~~~~~~~~~~~~~~~~~~~~~~~~~~~~~~~~~~~~~~~~~~~~~~~~~~~~~~~~~~~~~~
/uslocal/include/libgeneral/macros.h:84:43: note: expanded from macro 'reterror'
# define reterror(errstr ...) do{ throw tihmstar::EXPECTIONNAME(VERSION_COMMIT_COUNT, VERSION_COMMIT_SHA, __LINE__, __FILE__, errstr); } while(0)
^ ~~~~~~~~~~~~~~~~~~~~~~~~~~~~~~~~~~~~~~~~~~~~~~~~~~~~~~~~~~~~~~~~~~~~
../include/libinsn/INSNexception.hpp:19:9: note: candidate constructor not viable: no known conversion from 'const char [3]' to 'int' for 1st argument
INSNexception(int code, const char *filename, const char *err ...) : tihmstar::exception(code,filename,err){}
^
../include/libinsn/INSNexception.hpp:17:11: note: candidate constructor (the implicit copy constructor) not viable: requires 1 argument, but 5 were provided
class INSNexception : public tihmstar::exception{
^
../include/libinsn/INSNexception.hpp:17:11: note: candidate constructor (the implicit move constructor) not viable: requires 1 argument, but 5 were provided
insn_decode.cpp:674:17: error: no matching constructor for initialization of 'tihmstar::INSNexception'
reterror("can't get imm value of ldr that has non immediate subtype");
^~~~~~~~~~~~~~~~~~~~~~~~~~~~~~~~~~~~~~~~~~~~~~~~~~~~~~~~~~~~~~~~~~~~~
/uslocal/include/libgeneral/macros.h:84:43: note: expanded from macro 'reterror'
# define reterror(errstr ...) do{ throw tihmstar::EXPECTIONNAME(VERSION_COMMIT_COUNT, VERSION_COMMIT_SHA, __LINE__, __FILE__, errstr); } while(0)
^ ~~~~~~~~~~~~~~~~~~~~~~~~~~~~~~~~~~~~~~~~~~~~~~~~~~~~~~~~~~~~~~~~~~~~
../include/libinsn/INSNexception.hpp:19:9: note: candidate constructor not viable: no known conversion from 'const char [3]' to 'int' for 1st argument
INSNexception(int code, const char *filename, const char *err ...) : tihmstar::exception(code,filename,err){}
^
../include/libinsn/INSNexception.hpp:17:11: note: candidate constructor (the implicit copy constructor) not viable: requires 1 argument, but 5 were provided
class INSNexception : public tihmstar::exception{
^
../include/libinsn/INSNexception.hpp:17:11: note: candidate constructor (the implicit move constructor) not viable: requires 1 argument, but 5 were provided
insn_decode.cpp:684:17: error: no matching constructor for initialization of 'tihmstar::INSNexception'
reterror("can't get imm value of ldr that has non immediate subtype");
^~~~~~~~~~~~~~~~~~~~~~~~~~~~~~~~~~~~~~~~~~~~~~~~~~~~~~~~~~~~~~~~~~~~~
/uslocal/include/libgeneral/macros.h:84:43: note: expanded from macro 'reterror'
# define reterror(errstr ...) do{ throw tihmstar::EXPECTIONNAME(VERSION_COMMIT_COUNT, VERSION_COMMIT_SHA, __LINE__, __FILE__, errstr); } while(0)
^ ~~~~~~~~~~~~~~~~~~~~~~~~~~~~~~~~~~~~~~~~~~~~~~~~~~~~~~~~~~~~~~~~~~~~
../include/libinsn/INSNexception.hpp:19:9: note: candidate constructor not viable: no known conversion from 'const char [3]' to 'int' for 1st argument
INSNexception(int code, const char *filename, const char *err ...) : tihmstar::exception(code,filename,err){}
^
../include/libinsn/INSNexception.hpp:17:11: note: candidate constructor (the implicit copy constructor) not viable: requires 1 argument, but 5 were provided
class INSNexception : public tihmstar::exception{
^
../include/libinsn/INSNexception.hpp:17:11: note: candidate constructor (the implicit move constructor) not viable: requires 1 argument, but 5 were provided
insn_decode.cpp:701:17: error: no matching constructor for initialization of 'tihmstar::INSNexception'
reterror("ldrb must be st_immediate for imm to be defined!");
^~~~~~~~~~~~~~~~~~~~~~~~~~~~~~~~~~~~~~~~~~~~~~~~~~~~~~~~~~~~
/uslocal/include/libgeneral/macros.h:84:43: note: expanded from macro 'reterror'
# define reterror(errstr ...) do{ throw tihmstar::EXPECTIONNAME(VERSION_COMMIT_COUNT, VERSION_COMMIT_SHA, __LINE__, __FILE__, errstr); } while(0)
^ ~~~~~~~~~~~~~~~~~~~~~~~~~~~~~~~~~~~~~~~~~~~~~~~~~~~~~~~~~~~~~~~~~~~~
../include/libinsn/INSNexception.hpp:19:9: note: candidate constructor not viable: no known conversion from 'const char [3]' to 'int' for 1st argument
INSNexception(int code, const char *filename, const char *err ...) : tihmstar::exception(code,filename,err){}
^
../include/libinsn/INSNexception.hpp:17:11: note: candidate constructor (the implicit copy constructor) not viable: requires 1 argument, but 5 were provided
class INSNexception : public tihmstar::exception{
^
../include/libinsn/INSNexception.hpp:17:11: note: candidate constructor (the implicit move constructor) not viable: requires 1 argument, but 5 were provided
insn_decode.cpp:704:2: warning: TODO rewrite this! currently only unsigned offset supported [-W#warnings]
#warning TODO rewrite this! currently only unsigned offset supported
^
insn_decode.cpp:722:13: error: no matching constructor for initialization of 'tihmstar::INSNexception'
reterror("failed to get imm value");
^~~~~~~~~~~~~~~~~~~~~~~~~~~~~~~~~~~
/uslocal/include/libgeneral/macros.h:84:43: note: expanded from macro 'reterror'
# define reterror(errstr ...) do{ throw tihmstar::EXPECTIONNAME(VERSION_COMMIT_COUNT, VERSION_COMMIT_SHA, __LINE__, __FILE__, errstr); } while(0)
^ ~~~~~~~~~~~~~~~~~~~~~~~~~~~~~~~~~~~~~~~~~~~~~~~~~~~~~~~~~~~~~~~~~~~~
../include/libinsn/INSNexception.hpp:19:9: note: candidate constructor not viable: no known conversion from 'const char [3]' to 'int' for 1st argument
INSNexception(int code, const char *filename, const char *err ...) : tihmstar::exception(code,filename,err){}
^
../include/libinsn/INSNexception.hpp:17:11: note: candidate constructor (the implicit copy constructor) not viable: requires 1 argument, but 5 were provided
class INSNexception : public tihmstar::exception{
^
../include/libinsn/INSNexception.hpp:17:11: note: candidate constructor (the implicit move constructor) not viable: requires 1 argument, but 5 were provided
insn_decode.cpp:731:13: error: no matching constructor for initialization of 'tihmstar::INSNexception'
reterror("can't get rd of unknown instruction");
^~~~~~~~~~~~~~~~~~~~~~~~~~~~~~~~~~~~~~~~~~~~~~~
/uslocal/include/libgeneral/macros.h:84:43: note: expanded from macro 'reterror'
# define reterror(errstr ...) do{ throw tihmstar::EXPECTIONNAME(VERSION_COMMIT_COUNT, VERSION_COMMIT_SHA, __LINE__, __FILE__, errstr); } while(0)
^ ~~~~~~~~~~~~~~~~~~~~~~~~~~~~~~~~~~~~~~~~~~~~~~~~~~~~~~~~~~~~~~~~~~~~
../include/libinsn/INSNexception.hpp:19:9: note: candidate constructor not viable: no known conversion from 'const char [3]' to 'int' for 1st argument
INSNexception(int code, const char *filename, const char *err ...) : tihmstar::exception(code,filename,err){}
^
../include/libinsn/INSNexception.hpp:17:11: note: candidate constructor (the implicit copy constructor) not viable: requires 1 argument, but 5 were provided
class INSNexception : public tihmstar::exception{
^
../include/libinsn/INSNexception.hpp:17:11: note: candidate constructor (the implicit move constructor) not viable: requires 1 argument, but 5 were provided
insn_decode.cpp:749:13: error: no matching constructor for initialization of 'tihmstar::INSNexception'
reterror("failed to get rd");
^~~~~~~~~~~~~~~~~~~~~~~~~~~~
/uslocal/include/libgeneral/macros.h:84:43: note: expanded from macro 'reterror'
# define reterror(errstr ...) do{ throw tihmstar::EXPECTIONNAME(VERSION_COMMIT_COUNT, VERSION_COMMIT_SHA, __LINE__, __FILE__, errstr); } while(0)
^ ~~~~~~~~~~~~~~~~~~~~~~~~~~~~~~~~~~~~~~~~~~~~~~~~~~~~~~~~~~~~~~~~~~~~
../include/libinsn/INSNexception.hpp:19:9: note: candidate constructor not viable: no known conversion from 'const char [3]' to 'int' for 1st argument
INSNexception(int code, const char *filename, const char *err ...) : tihmstar::exception(code,filename,err){}
^
../include/libinsn/INSNexception.hpp:17:11: note: candidate constructor (the implicit copy constructor) not viable: requires 1 argument, but 5 were provided
class INSNexception : public tihmstar::exception{
^
../include/libinsn/INSNexception.hpp:17:11: note: candidate constructor (the implicit move constructor) not viable: requires 1 argument, but 5 were provided
insn_decode.cpp:757:13: error: no matching constructor for initialization of 'tihmstar::INSNexception'
reterror("can't get rn of unknown instruction");
^~~~~~~~~~~~~~~~~~~~~~~~~~~~~~~~~~~~~~~~~~~~~~~
/uslocal/include/libgeneral/macros.h:84:43: note: expanded from macro 'reterror'
# define reterror(errstr ...) do{ throw tihmstar::EXPECTIONNAME(VERSION_COMMIT_COUNT, VERSION_COMMIT_SHA, __LINE__, __FILE__, errstr); } while(0)
^ ~~~~~~~~~~~~~~~~~~~~~~~~~~~~~~~~~~~~~~~~~~~~~~~~~~~~~~~~~~~~~~~~~~~~
../include/libinsn/INSNexception.hpp:19:9: note: candidate constructor not viable: no known conversion from 'const char [3]' to 'int' for 1st argument
INSNexception(int code, const char *filename, const char *err ...) : tihmstar::exception(code,filename,err){}
^
../include/libinsn/INSNexception.hpp:17:11: note: candidate constructor (the implicit copy constructor) not viable: requires 1 argument, but 5 were provided
class INSNexception : public tihmstar::exception{
^
../include/libinsn/INSNexception.hpp:17:11: note: candidate constructor (the implicit move constructor) not viable: requires 1 argument, but 5 were provided
insn_decode.cpp:781:13: error: no matching constructor for initialization of 'tihmstar::INSNexception'
reterror("failed to get rn");
^~~~~~~~~~~~~~~~~~~~~~~~~~~~
/uslocal/include/libgeneral/macros.h:84:43: note: expanded from macro 'reterror'
# define reterror(errstr ...) do{ throw tihmstar::EXPECTIONNAME(VERSION_COMMIT_COUNT, VERSION_COMMIT_SHA, __LINE__, __FILE__, errstr); } while(0)
^ ~~~~~~~~~~~~~~~~~~~~~~~~~~~~~~~~~~~~~~~~~~~~~~~~~~~~~~~~~~~~~~~~~~~~
../include/libinsn/INSNexception.hpp:19:9: note: candidate constructor not viable: no known conversion from 'const char [3]' to 'int' for 1st argument
INSNexception(int code, const char *filename, const char *err ...) : tihmstar::exception(code,filename,err){}
^
../include/libinsn/INSNexception.hpp:17:11: note: candidate constructor (the implicit copy constructor) not viable: requires 1 argument, but 5 were provided
class INSNexception : public tihmstar::exception{
^
../include/libinsn/INSNexception.hpp:17:11: note: candidate constructor (the implicit move constructor) not viable: requires 1 argument, but 5 were provided
insn_decode.cpp:789:13: error: no matching constructor for initialization of 'tihmstar::INSNexception'
reterror("can't get rt of unknown instruction");
^~~~~~~~~~~~~~~~~~~~~~~~~~~~~~~~~~~~~~~~~~~~~~~
/uslocal/include/libgeneral/macros.h:84:43: note: expanded from macro 'reterror'
# define reterror(errstr ...) do{ throw tihmstar::EXPECTIONNAME(VERSION_COMMIT_COUNT, VERSION_COMMIT_SHA, __LINE__, __FILE__, errstr); } while(0)
^ ~~~~~~~~~~~~~~~~~~~~~~~~~~~~~~~~~~~~~~~~~~~~~~~~~~~~~~~~~~~~~~~~~~~~
../include/libinsn/INSNexception.hpp:19:9: note: candidate constructor not viable: no known conversion from 'const char [3]' to 'int' for 1st argument
INSNexception(int code, const char *filename, const char *err ...) : tihmstar::exception(code,filename,err){}
^
../include/libinsn/INSNexception.hpp:17:11: note: candidate constructor (the implicit copy constructor) not viable: requires 1 argument, but 5 were provided
class INSNexception : public tihmstar::exception{
^
../include/libinsn/INSNexception.hpp:17:11: note: candidate constructor (the implicit move constructor) not viable: requires 1 argument, but 5 were provided
insn_decode.cpp:807:13: error: no matching constructor for initialization of 'tihmstar::INSNexception'
reterror("failed to get rt");
^~~~~~~~~~~~~~~~~~~~~~~~~~~~
/uslocal/include/libgeneral/macros.h:84:43: note: expanded from macro 'reterror'
# define reterror(errstr ...) do{ throw tihmstar::EXPECTIONNAME(VERSION_COMMIT_COUNT, VERSION_COMMIT_SHA, __LINE__, __FILE__, errstr); } while(0)
^ ~~~~~~~~~~~~~~~~~~~~~~~~~~~~~~~~~~~~~~~~~~~~~~~~~~~~~~~~~~~~~~~~~~~~
../include/libinsn/INSNexception.hpp:19:9: note: candidate constructor not viable: no known conversion from 'const char [3]' to 'int' for 1st argument
INSNexception(int code, const char *filename, const char *err ...) : tihmstar::exception(code,filename,err){}
^
../include/libinsn/INSNexception.hpp:17:11: note: candidate constructor (the implicit copy constructor) not viable: requires 1 argument, but 5 were provided
class INSNexception : public tihmstar::exception{
^
../include/libinsn/INSNexception.hpp:17:11: note: candidate constructor (the implicit move constructor) not viable: requires 1 argument, but 5 were provided
insn_decode.cpp:818:13: error: no matching constructor for initialization of 'tihmstar::INSNexception'
reterror("failed to get rt2");
^~~~~~~~~~~~~~~~~~~~~~~~~~~~~
/uslocal/include/libgeneral/macros.h:84:43: note: expanded from macro 'reterror'
# define reterror(errstr ...) do{ throw tihmstar::EXPECTIONNAME(VERSION_COMMIT_COUNT, VERSION_COMMIT_SHA, __LINE__, __FILE__, errstr); } while(0)
^ ~~~~~~~~~~~~~~~~~~~~~~~~~~~~~~~~~~~~~~~~~~~~~~~~~~~~~~~~~~~~~~~~~~~~
../include/libinsn/INSNexception.hpp:19:9: note: candidate constructor not viable: no known conversion from 'const char [3]' to 'int' for 1st argument
INSNexception(int code, const char *filename, const char *err ...) : tihmstar::exception(code,filename,err){}
^
../include/libinsn/INSNexception.hpp:17:11: note: candidate constructor (the implicit copy constructor) not viable: requires 1 argument, but 5 were provided
class INSNexception : public tihmstar::exception{
^
../include/libinsn/INSNexception.hpp:17:11: note: candidate constructor (the implicit move constructor) not viable: requires 1 argument, but 5 were provided
fatal error: too many errors emitted, stopping now [-ferror-limit=]
4 warnings and 20 errors generated.
make[2]: *** [libinsn_la-insn_decode.lo] Error 1
make[1]: *** [all-recursive] Error 1
make: *** [all] Error 2
[email protected] libinsn %
submitted by Yuenkinken to jailbreak

5

[GB] Melody65 - live in 45 minutes from this post

Group buy starts: October 26, 2020 10:00 am EST (Countdown here)
BUY HERE: https://kbdfans.com/collections/melody65 GH: https://geekhack.org/index.php?topic=109263.0 UPDATE: https://geekhack.org/index.php?topic=109263.msg2976974#msg2976974
Price and limits:
For the standard kit $239 - higher for upgrades >>link<<
For the founder edition $349 - higher for upgrades >>link<< sold out after 1 minute
Limited to 500 units + 25 Founder edition FCFS

About:
Hello everyone, i'm proud to announce that the Melody65 GB will start in 4 days and will be launched on KBDFans. They will take care of the production, logistic and aftersale of the GB :)
The Melody65 is a sturdy top mount keyboard, comes with QMK and supports VIA.The project started over an year ago, born with the idea to make a different format layout of the Melody96, but ended up to be a fairly different keyboard: heavy, with very thick bezels, Fjell like bevels and a very thocc sound :)

Renders:

Real photos:
Links:

Info, Parts, materials and colors:
  • TOP: Aluminium anodized | Polycarbonate
  • BOTTOM: Aluminium anodized | Polycarbonate | Brass (FE)
  • PLATE: Aluminium anodized | Polycarbonate | Brass
  • PCB: Universal solder pcb (rgb underglow only) | Hotswap ANSI only (rgb on top only)
  • DAUGHTERBOARD: Type-C pcb
  • WEIGHT: Brass (no weight on the FE version)
  • ALU COLORS: E-white, Black, Dark Gray, Midnight Purple, Navy, Burgundy, Silver
  • OTHER: Custom magnetic box, bumpers, screws, etc..
  • SOFTWARE: QMK and will support VIA
  • INCLINATION: 7°

Kits options
You can mix and matches the top and bottom in the following ways:
  • Top alu / bottom alu : Starting at $239
  • Top PC / Bottom PC: Starting at $239
  • Top alu / Bottom PC: Starting at $239
  • Founder edition: Top alu / Bottom Brass : Starting at $349
All the kits starts with PC or Alu plate and with universal pcb, but you will be able to upgrade to brass plate and hotswap pcb for an extra price.
Plate layout by default will match the picked PCB.
Once you pick an anodization color, this will be used on all your alu parts.

Upgrades:
  • Upgrade to brass plate (+$17)
  • Upgrade to Hotswap pcb, has rgb per switch on top (+$15)
  • E-white upgrade cost: top (+$16), bottom (+$16), plate (+$7)

Extra:
  • Brass plate: $35
  • Alu or PC plate: $18
  • E-white plate: $25
  • Universal PCB: $34
  • Hotswap PCB ansi: $49
  • Plate foam or case foam: $7

Keyboard Weight (estimated):
  • Brass bottom (FE) / alu top / brass plate: 5.2+ Kg / 11.5 lbs
  • PC bottom / alu top / alu plate : 1.7 Kg / 3.3 lbs
  • Alu bottom / alu top / brass plate : 2.4 - 2.5 Kg / 5.5 lbs
  • PC bottom / PC top / pc plate : not estimated


Other GB Info:
  • GB Time: 26 October to 20 november (will close when limit of 500 is reached)
  • Delivery: TBD (will update this asap, must still define correctly), we are limiting to avoid delays

Notes:
  • Note that the keyboard is very high and big, about 25mm from front, but we are working to make it 2-3mm lower in height. We still suggest to use it with a wrist rest.
  • The plate will be slightly changed (to make it better).

Also would like to give a big shotout to RazoRSiM for the renders, CCC (italian mk community) for the support, Dion to work on this GB with me and KBDFans for helping and making this group buy possible. Also a big thanks to taehatypes for the stream!
For any question, i'm here to answer, see you all in less than 4 days :)
Cheers
-jkaos
submitted by jkaos92 to mechmarket